Reaction Details
TargetThromboxane A2 receptor
LigandBDBM50331732
Substrate/Competitorn/a
Meas. Tech.ChEMBL_686544 (CHEMBL1292331)
Ki 200±n/a nM
Citation Li, LBeaulieu, CCarriere, MCDenis, DGreig, GGuay, DO'Neill, GZamboni, RWang, Z Potent and highly selective DP1 antagonists with 2,3,4,9-tetrahydro-1H-carbazole as pharmacophore. Bioorg Med Chem Lett20:7462-5 (2010) 
 
Thromboxane A2 receptor
Name:Thromboxane A2 receptor
Type:Enyzme
Mol. Mass.:37445.28
Organism:Homo sapiens (Human)
Description:P21731
Residue:343
BDBM50331732
NameBDBM50331732
Synonyms:2-((R)-9-((S)-1-(4-chloro-3-fluorophenyl)ethyl)-6-fluoro-8-(methylsulfonyl)-2,3,4,9-tetrahydro-1H-carbazol-1-yl)acetic acid | CHEMBL1290080
TypeSmall organic molecule
Emp. Form.C23H22ClF2NO4S
Mol. Mass.481.94
SMILESC[C@@H](c1ccc(Cl)c(F)c1)n1c2[C@@H](CC(O)=O)CCCc2c2cc(F)cc(c12)S(C)(=O)=O