Reaction Details
TargetProstaglandin D2 receptor
LigandBDBM50331736
Substrate/Competitorn/a
Meas. Tech.ChEMBL_687945 (CHEMBL1291617)
Ki 0.31±n/a nM
Citation Li, LBeaulieu, CCarriere, MCDenis, DGreig, GGuay, DO'Neill, GZamboni, RWang, Z Potent and highly selective DP1 antagonists with 2,3,4,9-tetrahydro-1H-carbazole as pharmacophore. Bioorg Med Chem Lett20:7462-5 (2010) 
 
Prostaglandin D2 receptor
Name:Prostaglandin D2 receptor
Type:Enzyme
Mol. Mass.:40288.87
Organism:Homo sapiens (Human)
Description:Q13258
Residue:359
BDBM50331736
NameBDBM50331736
Synonyms:2-((R)-9-((S)-1-(3-chlorophenyl)ethyl)-6-fluoro-8-(methylsulfonyl)-2,3,4,9-tetrahydro-1H-carbazol-1-yl)acetic acid | CHEMBL1290299
TypeSmall organic molecule
Emp. Form.C23H23ClFNO4S
Mol. Mass.463.949
SMILESC[C@@H](c1cccc(Cl)c1)n1c2[C@@H](CC(O)=O)CCCc2c2cc(F)cc(c12)S(C)(=O)=O