Reaction Details
TargetThromboxane A2 receptor
LigandBDBM50331738
Substrate/Competitorn/a
Meas. Tech.ChEMBL_686544 (CHEMBL1292331)
Ki 100±n/a nM
Citation Li, LBeaulieu, CCarriere, MCDenis, DGreig, GGuay, DO'Neill, GZamboni, RWang, Z Potent and highly selective DP1 antagonists with 2,3,4,9-tetrahydro-1H-carbazole as pharmacophore. Bioorg Med Chem Lett20:7462-5 (2010) 
 
Thromboxane A2 receptor
Name:Thromboxane A2 receptor
Type:Enyzme
Mol. Mass.:37445.28
Organism:Homo sapiens (Human)
Description:P21731
Residue:343
BDBM50331738
NameBDBM50331738
Synonyms:2-((R)-6-fluoro-9-((S)-1-(4-fluorophenyl)ethyl)-8-(methylsulfonyl)-2,3,4,9-tetrahydro-1H-carbazol-1-yl)acetic acid | CHEMBL1290414
TypeSmall organic molecule
Emp. Form.C23H23F2NO4S
Mol. Mass.447.495
SMILESC[C@@H](c1ccc(F)cc1)n1c2[C@@H](CC(O)=O)CCCc2c2cc(F)cc(c12)S(C)(=O)=O