Reaction Details
TargetThromboxane A2 receptor
LigandBDBM50331740
Substrate/Competitorn/a
Meas. Tech.ChEMBL_686544 (CHEMBL1292331)
Ki 93±n/a nM
Citation Li, LBeaulieu, CCarriere, MCDenis, DGreig, GGuay, DO'Neill, GZamboni, RWang, Z Potent and highly selective DP1 antagonists with 2,3,4,9-tetrahydro-1H-carbazole as pharmacophore. Bioorg Med Chem Lett20:7462-5 (2010) 
 
Thromboxane A2 receptor
Name:Thromboxane A2 receptor
Type:Enyzme
Mol. Mass.:37445.28
Organism:Homo sapiens (Human)
Description:P21731
Residue:343
BDBM50331740
NameBDBM50331740
Synonyms:2-((R)-9-((S)-1-(4-cyanophenyl)ethyl)-6-fluoro-8-(methylsulfonyl)-2,3,4,9-tetrahydro-1H-carbazol-1-yl)acetic acid | CHEMBL1290524
TypeSmall organic molecule
Emp. Form.C24H23FN2O4S
Mol. Mass.454.514
SMILESC[C@@H](c1ccc(cc1)C#N)n1c2[C@@H](CC(O)=O)CCCc2c2cc(F)cc(c12)S(C)(=O)=O