Reaction Details
TargetProstaglandin D2 receptor
LigandBDBM50331741
Substrate/Competitorn/a
Meas. Tech.ChEMBL_687945 (CHEMBL1291617)
Ki 16.5±n/a nM
Citation Li, LBeaulieu, CCarriere, MCDenis, DGreig, GGuay, DO'Neill, GZamboni, RWang, Z Potent and highly selective DP1 antagonists with 2,3,4,9-tetrahydro-1H-carbazole as pharmacophore. Bioorg Med Chem Lett20:7462-5 (2010) 
 
Prostaglandin D2 receptor
Name:Prostaglandin D2 receptor
Type:Enzyme
Mol. Mass.:40288.87
Organism:Homo sapiens (Human)
Description:Q13258
Residue:359
BDBM50331741
NameBDBM50331741
Synonyms:2-((R)-6-fluoro-8-(methylsulfonyl)-9-((S)-1-(4-(methylsulfonyl)phenyl)ethyl)-2,3,4,9-tetrahydro-1H-carbazol-1-yl)acetic acid | CHEMBL1290638
TypeSmall organic molecule
Emp. Form.C24H26FNO6S2
Mol. Mass.507.595
SMILESC[C@@H](c1ccc(cc1)S(C)(=O)=O)n1c2[C@@H](CC(O)=O)CCCc2c2cc(F)cc(c12)S(C)(=O)=O