Reaction Details
TargetProstaglandin D2 receptor
LigandBDBM50331743
Substrate/Competitorn/a
Meas. Tech.ChEMBL_687945 (CHEMBL1291617)
Ki 0.39±n/a nM
Citation Li, LBeaulieu, CCarriere, MCDenis, DGreig, GGuay, DO'Neill, GZamboni, RWang, Z Potent and highly selective DP1 antagonists with 2,3,4,9-tetrahydro-1H-carbazole as pharmacophore. Bioorg Med Chem Lett20:7462-5 (2010) 
 
Prostaglandin D2 receptor
Name:Prostaglandin D2 receptor
Type:Enzyme
Mol. Mass.:40288.87
Organism:Homo sapiens (Human)
Description:Q13258
Residue:359
BDBM50331743
NameBDBM50331743
Synonyms:2-((R)-9-((R)-1-(4-chlorophenyl)-2,2-difluoroethyl)-6-fluoro-8-(methylsulfonyl)-2,3,4,9-tetrahydro-1H-carbazol-1-yl)acetic acid | CHEMBL1290755
TypeSmall organic molecule
Emp. Form.C23H21ClF3NO4S
Mol. Mass.499.93
SMILESCS(=O)(=O)c1cc(F)cc2c3CCC[C@H](CC(O)=O)c3n([C@@H](C(F)F)c3ccc(Cl)cc3)c12