Reaction Details
TargetCholesteryl ester transfer protein
LigandBDBM50331752
Substrate/Competitorn/a
Meas. Tech.ChEMBL_686691 (CHEMBL1290871)
IC50 4494±n/a nM
Citation Lu, ZNapolitano, JBTheberge, AAli, AHammond, MLTan, ETong, XXu, SSLatham, MJPeterson, LBAnderson, MSEveland, SSGuo, QHyland, SAMilot, DPChen, YSparrow, CPWright, SDSinclair, PJ Design of a novel class of biphenyl CETP inhibitors. Bioorg Med Chem Lett20:7469-72 (2010) 
 
Cholesteryl ester transfer protein
Name:Cholesteryl ester transfer protein
Type:Enzyme
Mol. Mass.:54751.53
Organism:Homo sapiens (Human)
Description:P11597
Residue:493
BDBM50331752
NameBDBM50331752
Synonyms:CHEMBL1290083 | methyl 3,5-bis(trifluoromethyl)benzyl((2'-ethoxy-5'-methyl-4-(trifluoromethyl)biphenyl-2-yl)methyl)carbamate
TypeSmall organic molecule
Emp. Form.C28H24F9NO3
Mol. Mass.593.4807
SMILESCCOc1ccc(C)cc1-c1ccc(cc1CN(Cc1cc(cc(c1)C(F)(F)F)C(F)(F)F)C(=O)OC)C(F)(F)F