Reaction Details
TargetEndochitinase A1
LigandBDBM16669
Substrate/Competitorn/a
Meas. Tech.ChEMBL_686888 (CHEMBL1291257)
IC50 850000±n/a nM
Citation Schüttelkopf, AWGros, LBlair, DEFrearson, JAvan Aalten, DMGilbert, IH Acetazolamide-based fungal chitinase inhibitors. Bioorg Med Chem18:8334-40 (2010) 
 
Endochitinase A1
Name:Endochitinase A1
Type:Enzyme
Mol. Mass.:83057.83
Organism:Neosartorya fumigata (Aspergillus fumigatus)
Description:Q873Y0
Residue:825
BDBM16669
NameBDBM16669
Synonyms:CHEMBL281376 heterocyclic sulfonamide compound 34
TypeSmall organic molecule
Emp. Form.C9H8N4O3S2
Mol. Mass.284.315
SMILESNS(=O)(=O)c1nnc(NC(=O)c2ccccc2)s1