Reaction Details
TargetEndochitinase A1
LigandBDBM50331851
Substrate/Competitorn/a
Meas. Tech.ChEMBL_686888 (CHEMBL1291257)
IC50 127000±n/a nM
Citation Schüttelkopf, AWGros, LBlair, DEFrearson, JAvan Aalten, DMGilbert, IH Acetazolamide-based fungal chitinase inhibitors. Bioorg Med Chem18:8334-40 (2010) 
 
Endochitinase A1
Name:Endochitinase A1
Type:Enzyme
Mol. Mass.:83057.83
Organism:Neosartorya fumigata (Aspergillus fumigatus)
Description:Q873Y0
Residue:825
BDBM50331851
NameBDBM50331851
Synonyms:Allosamidin | CHEMBL1230997
TypeSmall organic molecule
Emp. Form.C25H42N4O14
Mol. Mass.622.6194
SMILESCN(C)C1=N[C@@H]2[C@@H](O)[C@H](O[C@@H]3O[C@H](CO)[C@@H](O[C@@H]4O[C@H](CO)[C@@H](O)[C@@H](O)[C@H]4NC(C)=O)[C@@H](O)[C@H]3NC(C)=O)[C@@H](CO)[C@@H]2O1