Reaction Details
TargetProstaglandin G/H synthase 1
LigandBDBM50331888
Substrate/Competitorn/a
Meas. Tech.ChEMBL_687201 (CHEMBL1291826)
IC50 2560±n/a nM
Citation Lai, YMa, LHuang, WYu, XZhang, YJi, HTian, J Synthesis and biological evaluation of 3-[4-(amino/methylsulfonyl)phenyl]methylene-indolin-2-one derivatives as novel COX-1/2 and 5-LOX inhibitors. Bioorg Med Chem Lett20:7349-53 (2010) 
 
Prostaglandin G/H synthase 1
Name:Prostaglandin G/H synthase 1
Type:PROTEIN
Mol. Mass.:69079.81
Organism:Oryctolagus cuniculus
Description:ChEMBL_687201
Residue:606
BDBM50331888
NameBDBM50331888
Synonyms:5-Chloro-2-oxo-3-(thiophene-2-carbonyl)-2,3-dihydro-indole-1-carboxylic acid amide CHEMBL1097558 | Tenidap
TypeSmall organic molecule
Emp. Form.C14H9ClN2O3S
Mol. Mass.320.751
SMILESNC(=O)n1c(O)c(C(=O)c2cccs2)c2cc(Cl)ccc12