Reaction Details
TargetExtracellular calcium-sensing receptor
LigandBDBM50331962
Substrate/Competitorn/a
Meas. Tech.ChEMBL_687401 (CHEMBL1292077)
IC50>10000±n/a nM
Citation Yoshida, MMori, AInaba, AOka, MMakino, HYamaguchi, MFujita, HKawamoto, TGoto, MKimura, HBaba, AYasuma, T Synthesis and structure-activity relationship of tetrahydropyrazolopyrimidine derivatives--a novel structural class of potent calcium-sensing receptor antagonists. Bioorg Med Chem18:8501-11 (2010) 
 
Extracellular calcium-sensing receptor
Name:Extracellular calcium-sensing receptor
Type:Protein
Mol. Mass.:120663.13
Organism:Homo sapiens (Human)
Description:P41180
Residue:1078
BDBM50331962
NameBDBM50331962
Synonyms:CHEMBL1290215 | N-(1-Adamantyl)-7-trifluoromethyl-4,5,6,7-tetrahydropyrazolo[1,5-a]pyrim-idine-3-carboxamide
TypeSmall organic molecule
Emp. Form.C18H23F3N4O
Mol. Mass.368.3966
SMILESFC(F)(F)[C@H]1CCNc2c(cnn12)C(=O)NC12CC3CC(CC(C3)C1)C2