Reaction Details
TargetPhospholipase C
LigandBDBM50332109
Substrate/Competitorn/a
Meas. Tech.ChEMBL_687786 (CHEMBL1291232)
IC50 8000±n/a nM
Citation González-Bulnes, PGonzález-Roura, ACanals, DDelgado, ACasas, JLlebaria, A 2-aminohydroxamic acid derivatives as inhibitors of Bacillus cereus phosphatidylcholine preferred phospholipase C PC-PLC(Bc). Bioorg Med Chem18:8549-55 (2010) 
 
Phospholipase C
Name:Phospholipase C
Type:PROTEIN
Mol. Mass.:32387.39
Organism:Bacillus cereus
Description:ChEMBL_687786
Residue:283
BDBM50332109
NameBDBM50332109
Synonyms:CHEMBL1287861 | Tert-butyl 1-(benzyloxy[3-(dimethylamino)propyl]amino)-1-oxododecan-2-ylcarbamate
TypeSmall organic molecule
Emp. Form.C29H51N3O4
Mol. Mass.505.7329
SMILESCCCCCCCCCCC(NC(=O)OC(C)(C)C)C(=O)N(CCCN(C)C)OCc1ccccc1