Reaction Details
TargetNAD(P)H dehydrogenase [quinone] 1
LigandBDBM50332182
Substrate/Competitorn/a
Meas. Tech.ChEMBL_687952 (CHEMBL1291624)
IC50 80000±n/a nM
Citation Nolan, KACaraher, MCHumphries, MPBettley, HABryce, RAStratford, IJ In silico identification and biochemical evaluation of novel inhibitors of NRH:quinone oxidoreductase 2 (NQO2). Bioorg Med Chem Lett20:7331-6 (2010) 
 
NAD(P)H dehydrogenase [quinone] 1
Name:NAD(P)H dehydrogenase [quinone] 1
Type:Homodimer
Mol. Mass.:30874.82
Organism:Homo sapiens (Human)
Description:n/a
Residue:274
BDBM50332182
NameBDBM50332182
Synonyms:4,3',5'-tri-O-methylpiceatannol 5-[(E)-2-(3,5-Dimethoxy-phenyl)-vinyl]-2-methoxy-phenol CHEMBL419378 US11866416, Example 9
TypeSmall organic molecule
Emp. Form.C17H18O4
Mol. Mass.286.3224
SMILESCOc1cc(OC)cc(\C=C\c2ccc(OC)c(O)c2)c1