Reaction Details
TargetCannabinoid receptor 1
LigandBDBM50332258
Substrate/Competitorn/a
Meas. Tech.ChEMBL_685959 (CHEMBL1292715)
Ki>10000±n/a nM
Citation Osman, NAMahmoud, AHAllarà, MNiess, RAbouzid, KADi Marzo, VAbadi, AH Synthesis, binding studies and molecular modeling of novel cannabinoid receptor ligands. Bioorg Med Chem18:8463-77 (2010) 
 
Cannabinoid receptor 1
Name:Cannabinoid receptor 1
Type:G Protein-Coupled Receptor (GPCR)
Mol. Mass.:52868.96
Organism:Homo sapiens (Human)
Description:P21554
Residue:472
BDBM50332258
NameBDBM50332258
Synonyms:(E)-7-Naphthalen-2-yl-5-oxohept-6-enoic acid(2-hydroxy-1(R)-methylethanolamide | CHEMBL1288237
TypeSmall organic molecule
Emp. Form.C20H23NO3
Mol. Mass.325.4015
SMILESC[C@@H](CO)NC(=O)CCCC(=O)C=Cc1ccc2ccccc2c1