Reaction Details
TargetCannabinoid receptor 2
LigandBDBM50332246
Substrate/Competitorn/a
Meas. Tech.ChEMBL_685961 (CHEMBL1292717)
IC50>10000±n/a nM
Citation Osman, NAMahmoud, AHAllarà, MNiess, RAbouzid, KADi Marzo, VAbadi, AH Synthesis, binding studies and molecular modeling of novel cannabinoid receptor ligands. Bioorg Med Chem18:8463-77 (2010) 
 
Cannabinoid receptor 2
Name:Cannabinoid receptor 2
Type:G Protein-Coupled Receptor (GPCR)
Mol. Mass.:39690.94
Organism:Homo sapiens (Human)
Description:P34972
Residue:360
BDBM50332246
NameBDBM50332246
Synonyms:(E)-N-(4-Hydroxyphenyl)-6-(4-methoxyphenyl)-4-oxohex-5-enamide | CHEMBL1288118
TypeSmall organic molecule
Emp. Form.C19H19NO4
Mol. Mass.325.3585
SMILESCOc1ccc(C=CC(=O)CCC(=O)Nc2ccc(O)cc2)cc1