Reaction Details
TargetCannabinoid receptor 2
LigandBDBM50332247
Substrate/Competitorn/a
Meas. Tech.ChEMBL_685961 (CHEMBL1292717)
IC50>10000±n/a nM
Citation Osman, NAMahmoud, AHAllarà, MNiess, RAbouzid, KADi Marzo, VAbadi, AH Synthesis, binding studies and molecular modeling of novel cannabinoid receptor ligands. Bioorg Med Chem18:8463-77 (2010) 
 
Cannabinoid receptor 2
Name:Cannabinoid receptor 2
Type:G Protein-Coupled Receptor (GPCR)
Mol. Mass.:39690.94
Organism:Homo sapiens (Human)
Description:P34972
Residue:360
BDBM50332247
NameBDBM50332247
Synonyms:(E)-6-Naphthalen-2-yl-4-oxohex-5-enoic acid piperidinamide | CHEMBL1288119
TypeSmall organic molecule
Emp. Form.C21H23NO2
Mol. Mass.321.4128
SMILESO=C(CCC(=O)N1CCCCC1)C=Cc1ccc2ccccc2c1