Reaction Details
TargetCannabinoid receptor 2
LigandBDBM50332252
Substrate/Competitorn/a
Meas. Tech.ChEMBL_685961 (CHEMBL1292717)
Ki>10000±n/a nM
Citation Osman, NAMahmoud, AHAllarà, MNiess, RAbouzid, KADi Marzo, VAbadi, AH Synthesis, binding studies and molecular modeling of novel cannabinoid receptor ligands. Bioorg Med Chem18:8463-77 (2010) 
 
Cannabinoid receptor 2
Name:Cannabinoid receptor 2
Type:G Protein-Coupled Receptor (GPCR)
Mol. Mass.:39690.94
Organism:Homo sapiens (Human)
Description:P34972
Residue:360
BDBM50332252
NameBDBM50332252
Synonyms:(E)-6-Naphthalen-2-yl-4-oxohex-5-enoic acid diethanolamide | CHEMBL1288179
TypeSmall organic molecule
Emp. Form.C20H23NO4
Mol. Mass.341.4009
SMILESOCCN(CCO)C(=O)CCC(=O)C=Cc1ccc2ccccc2c1