Reaction Details
TargetCannabinoid receptor 2
LigandBDBM50332257
Substrate/Competitorn/a
Meas. Tech.ChEMBL_685961 (CHEMBL1292717)
Ki>10000±n/a nM
Citation Osman, NAMahmoud, AHAllarà, MNiess, RAbouzid, KADi Marzo, VAbadi, AH Synthesis, binding studies and molecular modeling of novel cannabinoid receptor ligands. Bioorg Med Chem18:8463-77 (2010) 
 
Cannabinoid receptor 2
Name:Cannabinoid receptor 2
Type:G Protein-Coupled Receptor (GPCR)
Mol. Mass.:39690.94
Organism:Homo sapiens (Human)
Description:P34972
Residue:360
BDBM50332257
NameBDBM50332257
Synonyms:(E)-7-Naphthalen-2-yl-5-oxo-hept-6-enoic acid glycinamide ethyl ester | CHEMBL1288210
TypeSmall organic molecule
Emp. Form.C21H23NO4
Mol. Mass.353.4116
SMILESCCOC(=O)CNC(=O)CCCC(=O)C=Cc1ccc2ccccc2c1