Reaction Details
TargetPotassium voltage-gated channel subfamily H member 2
LigandBDBM50417543
Substrate/Competitorn/a
Meas. Tech.ChEMBL_689721 (CHEMBL1635449)
Ki 50.12±n/a nM
Citation Leslie, CPBiagetti, MBison, SBromidge, SMFabio, RDDonati, DFalchi, AGarnier, MJJaxa-Chamiec, AManchee, GMerlo, GPizzi, DAStasi, LPTibasco, JVong, AWard, SE Discovery of 1-(3-{2-[4-(2-Methyl-5-quinolinyl)-1-piperazinyl]ethyl}phenyl)-2-imidazolidinone (GSK163090), a Potent, Selective, and Orally Active 5-HT1A/B/D Receptor Antagonist J Med Chem53:8228-8240 (2010) 
 
Potassium voltage-gated channel subfamily H member 2
Name:Potassium voltage-gated channel subfamily H member 2
Type:Multi-pass membrane protein
Mol. Mass.:126672.65
Organism:Homo sapiens (Human)
Description:Q12809
Residue:1159
BDBM50417543
NameBDBM50417543
Synonyms:CHEMBL1632210
TypeSmall organic molecule
Emp. Form.C29H30N4O
Mol. Mass.450.5747
SMILESCc1ccc2c(cccc2n1)N1CCN(CCc2cccc(NC(=O)c3ccccc3)c2)CC1