Reaction Details
Target[Pyruvate dehydrogenase (acetyl-transferring)] kinase isozyme 1, mitochondrial
LigandBDBM50333029
Substrate/Competitorn/a
Meas. Tech.ChEMBL_689885 (CHEMBL1633334)
IC50>100000±n/a nM
Citation Barile, EDe, SKCarlson, CBChen, VKnutzen, CRiel-Mehan, MYang, LDahl, RChiang, G Design, Synthesis, and Structure−Activity Relationships of 3-Ethynyl-1H-indazoles as Inhibitors of the Phosphatidylinositol 3-Kinase Signaling Pathway J Med Chem53:8368-8375 (2010) 
 
[Pyruvate dehydrogenase (acetyl-transferring)] kinase isozyme 1, mitochondrial
Name:[Pyruvate dehydrogenase (acetyl-transferring)] kinase isozyme 1, mitochondrial
Type:Protein
Mol. Mass.:49255.23
Organism:Homo sapiens (Human)
Description:Q15118
Residue:436
BDBM50333029
NameBDBM50333029
Synonyms:3-((3,5-Difluorophenyl)ethynyl)-1H-indazole | CHEMBL1631890
TypeSmall organic molecule
Emp. Form.C15H8F2N2
Mol. Mass.254.2342
SMILESFc1cc(F)cc(c1)C#Cc1n[nH]c2ccccc12