Reaction Details
TargetSerine/threonine-protein kinase mTOR
LigandBDBM50333016
Substrate/Competitorn/a
Meas. Tech.ChEMBL_689884 (CHEMBL1633333)
IC50 5000±n/a nM
Citation Barile, EDe, SKCarlson, CBChen, VKnutzen, CRiel-Mehan, MYang, LDahl, RChiang, G Design, Synthesis, and Structure−Activity Relationships of 3-Ethynyl-1H-indazoles as Inhibitors of the Phosphatidylinositol 3-Kinase Signaling Pathway J Med Chem53:8368-8375 (2010) 
 
Serine/threonine-protein kinase mTOR
Name:Serine/threonine-protein kinase mTOR
Type:Rapamycin target protein
Mol. Mass.:288917.12
Organism:Homo sapiens (Human)
Description:P42345
Residue:2549
BDBM50333016
NameBDBM50333016
Synonyms:3-(Pyridin-2-ylethynyl)-1H-pyrazolo[3,4-b]pyridine | CHEMBL1631903
TypeSmall organic molecule
Emp. Form.C13H8N4
Mol. Mass.220.2294
SMILESc1cncc(c1)C#Cc1n[nH]c2ncccc12