Reaction Details
TargetSerine/threonine-protein kinase mTOR
LigandBDBM50333019
Substrate/Competitorn/a
Meas. Tech.ChEMBL_689884 (CHEMBL1633333)
IC50>100000±n/a nM
Citation Barile, EDe, SKCarlson, CBChen, VKnutzen, CRiel-Mehan, MYang, LDahl, RChiang, G Design, Synthesis, and Structure−Activity Relationships of 3-Ethynyl-1H-indazoles as Inhibitors of the Phosphatidylinositol 3-Kinase Signaling Pathway J Med Chem53:8368-8375 (2010) 
 
Serine/threonine-protein kinase mTOR
Name:Serine/threonine-protein kinase mTOR
Type:Rapamycin target protein
Mol. Mass.:288917.12
Organism:Homo sapiens (Human)
Description:P42345
Residue:2549
BDBM50333019
NameBDBM50333019
Synonyms:3-(Thiophen-3-ylethynyl)-1H-indazole | CHEMBL1631900
TypeSmall organic molecule
Emp. Form.C13H8N2S
Mol. Mass.224.281
SMILESc1cc(cs1)C#Cc1n[nH]c2ccccc12