Reaction Details
TargetPhosphatidylinositol 4,5-bisphosphate 3-kinase catalytic subunit alpha isoform
LigandBDBM50333017
Substrate/Competitorn/a
Meas. Tech.ChEMBL_689883 (CHEMBL1633332)
IC50 3050±n/a nM
Citation Barile, EDe, SKCarlson, CBChen, VKnutzen, CRiel-Mehan, MYang, LDahl, RChiang, G Design, Synthesis, and Structure−Activity Relationships of 3-Ethynyl-1H-indazoles as Inhibitors of the Phosphatidylinositol 3-Kinase Signaling Pathway J Med Chem53:8368-8375 (2010) 
 
Phosphatidylinositol 4,5-bisphosphate 3-kinase catalytic subunit alpha isoform
Name:Phosphatidylinositol 4,5-bisphosphate 3-kinase catalytic subunit alpha isoform
Type:Enzyme Subunit
Mol. Mass.:124294.87
Organism:Homo sapiens (Human)
Description:P42336
Residue:1068
BDBM50333017
NameBDBM50333017
Synonyms:3-(Pyridin-4-ylethynyl)-1H-pyrazolo[3,4-b]pyridine | CHEMBL1631902
TypeSmall organic molecule
Emp. Form.C13H8N4
Mol. Mass.220.2294
SMILESc1cnc2[nH]nc(C#Cc3ccncc3)c2c1