Reaction Details
TargetPhosphatidylinositol 4,5-bisphosphate 3-kinase catalytic subunit alpha isoform
LigandBDBM50333022
Substrate/Competitorn/a
Meas. Tech.ChEMBL_689883 (CHEMBL1633332)
IC50>100000±n/a nM
Citation Barile, EDe, SKCarlson, CBChen, VKnutzen, CRiel-Mehan, MYang, LDahl, RChiang, G Design, Synthesis, and Structure−Activity Relationships of 3-Ethynyl-1H-indazoles as Inhibitors of the Phosphatidylinositol 3-Kinase Signaling Pathway J Med Chem53:8368-8375 (2010) 
 
Phosphatidylinositol 4,5-bisphosphate 3-kinase catalytic subunit alpha isoform
Name:Phosphatidylinositol 4,5-bisphosphate 3-kinase catalytic subunit alpha isoform
Type:Enzyme Subunit
Mol. Mass.:124294.87
Organism:Homo sapiens (Human)
Description:P42336
Residue:1068
BDBM50333022
NameBDBM50333022
Synonyms:3-(Cyclopropylethynyl)-1H-indazole | CHEMBL1631897
TypeSmall organic molecule
Emp. Form.C12H10N2
Mol. Mass.182.2212
SMILESC1CC1C#Cc1n[nH]c2ccccc12