Reaction Details
TargetEnvelope glycoprotein gp160
LigandBDBM50333228
Substrate/Competitorn/a
Meas. Tech.ChEMBL_698262 (CHEMBL1646732)
Kd 2600±n/a nM
Citation Lalonde, JMElban, MACourter, JRSugawara, ASoeta, TMadani, NPrinciotto, AMKwon, YDKwong, PDSchön, AFreire, ESodroski, JSmith, AB Design, synthesis and biological evaluation of small molecule inhibitors of CD4-gp120 binding based on virtual screening. Bioorg Med Chem19:91-101 (2011) 
 
Envelope glycoprotein gp160
Name:Envelope glycoprotein gp160
Type:PROTEIN
Mol. Mass.:95667.71
Organism:Human immunodeficiency virus type 1 group M subtype B (isolate YU-2)(HIV-1)
Description:ChEMBL_698262
Residue:843
BDBM50333228
NameBDBM50333228
Synonyms:CHEMBL1645270 | N1-(((4S,5S)-5-(aminomethyl)-2,2-dimethyl-1,3-dioxolan-4-yl)methyl)-N2-(4-chloro-3-fluorophenyl)oxalamide
TypeSmall organic molecule
Emp. Form.C15H19ClFN3O4
Mol. Mass.359.78
SMILESCC1(C)O[C@@H](CN)[C@H](CNC(=O)C(=O)Nc2ccc(Cl)c(F)c2)O1