Reaction Details
TargetEnvelope glycoprotein gp160
LigandBDBM50333231
Substrate/Competitorn/a
Meas. Tech.ChEMBL_698262 (CHEMBL1646732)
Kd 3200±n/a nM
Citation Lalonde, JMElban, MACourter, JRSugawara, ASoeta, TMadani, NPrinciotto, AMKwon, YDKwong, PDSchön, AFreire, ESodroski, JSmith, AB Design, synthesis and biological evaluation of small molecule inhibitors of CD4-gp120 binding based on virtual screening. Bioorg Med Chem19:91-101 (2011) 
 
Envelope glycoprotein gp160
Name:Envelope glycoprotein gp160
Type:PROTEIN
Mol. Mass.:95667.71
Organism:Human immunodeficiency virus type 1 group M subtype B (isolate YU-2)(HIV-1)
Description:ChEMBL_698262
Residue:843
BDBM50333231
NameBDBM50333231
Synonyms:CHEMBL1645267 | N1-(4-chloro-3-fluorophenyl)-N2-((1-(2-hydroxyethyl)piperidin-3-yl)methyl)oxalamide
TypeSmall organic molecule
Emp. Form.C16H21ClFN3O3
Mol. Mass.357.808
SMILESOCCN1CCCC(CNC(=O)C(=O)Nc2ccc(Cl)c(F)c2)C1