Reaction Details
TargetEnvelope glycoprotein gp160
LigandBDBM50333232
Substrate/Competitorn/a
Meas. Tech.ChEMBL_698262 (CHEMBL1646732)
Kd 1600±n/a nM
Citation Lalonde, JMElban, MACourter, JRSugawara, ASoeta, TMadani, NPrinciotto, AMKwon, YDKwong, PDSchön, AFreire, ESodroski, JSmith, AB Design, synthesis and biological evaluation of small molecule inhibitors of CD4-gp120 binding based on virtual screening. Bioorg Med Chem19:91-101 (2011) 
 
Envelope glycoprotein gp160
Name:Envelope glycoprotein gp160
Type:PROTEIN
Mol. Mass.:95667.71
Organism:Human immunodeficiency virus type 1 group M subtype B (isolate YU-2)(HIV-1)
Description:ChEMBL_698262
Residue:843
BDBM50333232
NameBDBM50333232
Synonyms:CHEMBL1645266 | N1-(4-chloro-3-fluorophenyl)-N2-(2-((2S,6R)-2,6-dimethylpiperidin-1-yl)ethyl)oxalamide
TypeSmall organic molecule
Emp. Form.C17H23ClFN3O2
Mol. Mass.355.835
SMILESC[C@H]1CCC[C@@H](C)N1CCNC(=O)C(=O)Nc1ccc(Cl)c(F)c1