Reaction Details
TargetEnvelope glycoprotein gp160
LigandBDBM50333233
Substrate/Competitorn/a
Meas. Tech.ChEMBL_698262 (CHEMBL1646732)
Kd 600±n/a nM
Citation Lalonde, JMElban, MACourter, JRSugawara, ASoeta, TMadani, NPrinciotto, AMKwon, YDKwong, PDSchön, AFreire, ESodroski, JSmith, AB Design, synthesis and biological evaluation of small molecule inhibitors of CD4-gp120 binding based on virtual screening. Bioorg Med Chem19:91-101 (2011) 
 
Envelope glycoprotein gp160
Name:Envelope glycoprotein gp160
Type:PROTEIN
Mol. Mass.:95667.71
Organism:Human immunodeficiency virus type 1 group M subtype B (isolate YU-2)(HIV-1)
Description:ChEMBL_698262
Residue:843
BDBM50333233
NameBDBM50333233
Synonyms:CHEMBL1645265 | N1-(4-chloro-3-fluorophenyl)-N2-(5-azaspiro[3.5]nonan-8-yl)oxalamide
TypeSmall organic molecule
Emp. Form.C16H19ClFN3O2
Mol. Mass.339.792
SMILESFc1cc(NC(=O)C(=O)NC2CCNC3(CCC3)C2)ccc1Cl