Reaction Details
TargetEnvelope glycoprotein gp160
LigandBDBM50333244
Substrate/Competitorn/a
Meas. Tech.ChEMBL_698262 (CHEMBL1646732)
Kd 3100±n/a nM
Citation Lalonde, JMElban, MACourter, JRSugawara, ASoeta, TMadani, NPrinciotto, AMKwon, YDKwong, PDSchön, AFreire, ESodroski, JSmith, AB Design, synthesis and biological evaluation of small molecule inhibitors of CD4-gp120 binding based on virtual screening. Bioorg Med Chem19:91-101 (2011) 
 
Envelope glycoprotein gp160
Name:Envelope glycoprotein gp160
Type:PROTEIN
Mol. Mass.:95667.71
Organism:Human immunodeficiency virus type 1 group M subtype B (isolate YU-2)(HIV-1)
Description:ChEMBL_698262
Residue:843
BDBM50333244
NameBDBM50333244
Synonyms:CHEMBL1645255 | N1-(4-chloro-3-fluorophenyl)-N2-(((3aS,6aS)-octahydrocyclopenta[c]pyrrol-3a-yl)methyl)oxalamide
TypeSmall organic molecule
Emp. Form.C16H19ClFN3O2
Mol. Mass.339.792
SMILESFc1cc(NC(=O)C(=O)NC[C@@]23CCC[C@@H]2CNC3)ccc1Cl