Reaction Details
TargetEnvelope glycoprotein gp160
LigandBDBM50333257
Substrate/Competitorn/a
Meas. Tech.ChEMBL_698262 (CHEMBL1646732)
Kd 2300±n/a nM
Citation Lalonde, JMElban, MACourter, JRSugawara, ASoeta, TMadani, NPrinciotto, AMKwon, YDKwong, PDSchön, AFreire, ESodroski, JSmith, AB Design, synthesis and biological evaluation of small molecule inhibitors of CD4-gp120 binding based on virtual screening. Bioorg Med Chem19:91-101 (2011) 
 
Envelope glycoprotein gp160
Name:Envelope glycoprotein gp160
Type:PROTEIN
Mol. Mass.:95667.71
Organism:Human immunodeficiency virus type 1 group M subtype B (isolate YU-2)(HIV-1)
Description:ChEMBL_698262
Residue:843
BDBM50333257
NameBDBM50333257
Synonyms:CHEMBL1645242 | N1-(4-chloro-3-fluorophenyl)-N2-(2-(1-isopropylpiperidin-2-yl)ethyl)oxalamide
TypeSmall organic molecule
Emp. Form.C18H25ClFN3O2
Mol. Mass.369.861
SMILESCC(C)N1CCCCC1CCNC(=O)C(=O)Nc1ccc(Cl)c(F)c1