Reaction Details
TargetEnvelope glycoprotein gp160
LigandBDBM50333260
Substrate/Competitorn/a
Meas. Tech.ChEMBL_698262 (CHEMBL1646732)
Kd 4200±n/a nM
Citation Lalonde, JMElban, MACourter, JRSugawara, ASoeta, TMadani, NPrinciotto, AMKwon, YDKwong, PDSchön, AFreire, ESodroski, JSmith, AB Design, synthesis and biological evaluation of small molecule inhibitors of CD4-gp120 binding based on virtual screening. Bioorg Med Chem19:91-101 (2011) 
 
Envelope glycoprotein gp160
Name:Envelope glycoprotein gp160
Type:PROTEIN
Mol. Mass.:95667.71
Organism:Human immunodeficiency virus type 1 group M subtype B (isolate YU-2)(HIV-1)
Description:ChEMBL_698262
Residue:843
BDBM50333260
NameBDBM50333260
Synonyms:CHEMBL1645131 | N1-(4-chloro-3-fluorophenyl)-N2-(1-methylpiperidin-3-yl)oxalamide
TypeSmall organic molecule
Emp. Form.C14H17ClFN3O2
Mol. Mass.313.755
SMILESCN1CCCC(C1)NC(=O)C(=O)Nc1ccc(Cl)c(F)c1