Reaction Details
TargetEnvelope glycoprotein gp160
LigandBDBM50333262
Substrate/Competitorn/a
Meas. Tech.ChEMBL_698262 (CHEMBL1646732)
Kd 1300±n/a nM
Citation Lalonde, JMElban, MACourter, JRSugawara, ASoeta, TMadani, NPrinciotto, AMKwon, YDKwong, PDSchön, AFreire, ESodroski, JSmith, AB Design, synthesis and biological evaluation of small molecule inhibitors of CD4-gp120 binding based on virtual screening. Bioorg Med Chem19:91-101 (2011) 
 
Envelope glycoprotein gp160
Name:Envelope glycoprotein gp160
Type:PROTEIN
Mol. Mass.:95667.71
Organism:Human immunodeficiency virus type 1 group M subtype B (isolate YU-2)(HIV-1)
Description:ChEMBL_698262
Residue:843
BDBM50333262
NameBDBM50333262
Synonyms:4-(2-(4-chloro-3-fluorophenylamino)-2-oxoacetamido)-1,2,2,6,6-pentamethylpiperidine 1-oxide | CHEMBL1645130
TypeSmall organic molecule
Emp. Form.C18H25ClFN3O3
Mol. Mass.385.861
SMILESCC1(C)CC(CC(C)(C)[N+]1(C)[O-])NC(=O)C(=O)Nc1ccc(Cl)c(F)c1