Reaction Details
Target5-hydroxytryptamine receptor 1A
LigandBDBM50333430
Substrate/Competitorn/a
Meas. Tech.ChEMBL_698908 (CHEMBL1645848)
Ki 22±n/a nM
Citation Pettersson, MCampbell, BMDounay, ABGray, DLXie, LO'Donnell, CJStratman, NCZoski, KDrummond, EBora, GProbert, AWhisman, T Design, synthesis, and pharmacological evaluation of azetedine and pyrrolidine derivatives as dual norepinephrine reuptake inhibitors and 5-HT(1A) partial agonists. Bioorg Med Chem Lett21:865-8 (2011) 
 
5-hydroxytryptamine receptor 1A
Name:5-hydroxytryptamine receptor 1A
Type:n/a
Mol. Mass.:46122.49
Organism:Homo sapiens (Human)
Description:n/a
Residue:422
BDBM50333430
NameBDBM50333430
Synonyms:3-(2-(2-fluorophenoxy)phenoxy)azetidine | CHEMBL1645597
TypeSmall organic molecule
Emp. Form.C15H14FNO2
Mol. Mass.259.2756
SMILESFc1ccccc1Oc1ccccc1OC1CNC1