Reaction Details
Target5-hydroxytryptamine receptor 1A
LigandBDBM50333441
Substrate/Competitorn/a
Meas. Tech.ChEMBL_698908 (CHEMBL1645848)
Ki 8±n/a nM
Citation Pettersson, MCampbell, BMDounay, ABGray, DLXie, LO'Donnell, CJStratman, NCZoski, KDrummond, EBora, GProbert, AWhisman, T Design, synthesis, and pharmacological evaluation of azetedine and pyrrolidine derivatives as dual norepinephrine reuptake inhibitors and 5-HT(1A) partial agonists. Bioorg Med Chem Lett21:865-8 (2011) 
 
5-hydroxytryptamine receptor 1A
Name:5-hydroxytryptamine receptor 1A
Type:n/a
Mol. Mass.:46122.49
Organism:Homo sapiens (Human)
Description:n/a
Residue:422
BDBM50333441
NameBDBM50333441
Synonyms:4-(2-(2-chloro-6-fluorophenoxy)-6-fluorophenoxy)piperidine | CHEMBL1645608
TypeSmall organic molecule
Emp. Form.C17H16ClF2NO2
Mol. Mass.339.764
SMILESFc1cccc(Oc2c(F)cccc2Cl)c1OC1CCNCC1