Reaction Details
Target5-hydroxytryptamine receptor 1A
LigandBDBM50333442
Substrate/Competitorn/a
Meas. Tech.ChEMBL_698908 (CHEMBL1645848)
Ki 4±n/a nM
Citation Pettersson, MCampbell, BMDounay, ABGray, DLXie, LO'Donnell, CJStratman, NCZoski, KDrummond, EBora, GProbert, AWhisman, T Design, synthesis, and pharmacological evaluation of azetedine and pyrrolidine derivatives as dual norepinephrine reuptake inhibitors and 5-HT(1A) partial agonists. Bioorg Med Chem Lett21:865-8 (2011) 
 
5-hydroxytryptamine receptor 1A
Name:5-hydroxytryptamine receptor 1A
Type:n/a
Mol. Mass.:46122.49
Organism:Homo sapiens (Human)
Description:n/a
Residue:422
BDBM50333442
NameBDBM50333442
Synonyms:4-(2-fluoro-6-(2-fluoro-6-methylphenoxy)phenoxy)piperidine | CHEMBL1645609
TypeSmall organic molecule
Emp. Form.C18H19F2NO2
Mol. Mass.319.3458
SMILESCc1cccc(F)c1Oc1cccc(F)c1OC1CCNCC1