Reaction Details
Target5-hydroxytryptamine receptor 1A
LigandBDBM50333446
Substrate/Competitorn/a
Meas. Tech.ChEMBL_698908 (CHEMBL1645848)
Ki 19±n/a nM
Citation Pettersson, MCampbell, BMDounay, ABGray, DLXie, LO'Donnell, CJStratman, NCZoski, KDrummond, EBora, GProbert, AWhisman, T Design, synthesis, and pharmacological evaluation of azetedine and pyrrolidine derivatives as dual norepinephrine reuptake inhibitors and 5-HT(1A) partial agonists. Bioorg Med Chem Lett21:865-8 (2011) 
 
5-hydroxytryptamine receptor 1A
Name:5-hydroxytryptamine receptor 1A
Type:n/a
Mol. Mass.:46122.49
Organism:Homo sapiens (Human)
Description:n/a
Residue:422
BDBM50333446
NameBDBM50333446
Synonyms:3-(2-(2-chlorophenoxy)-6-fluorophenoxy)pyrrolidine | CHEMBL1645613
TypeSmall organic molecule
Emp. Form.C16H15ClFNO2
Mol. Mass.307.747
SMILESFc1cccc(Oc2ccccc2Cl)c1OC1CCNC1