Reaction Details
TargetProstaglandin D2 receptor 2
LigandBDBM50333492
Substrate/Competitorn/a
Meas. Tech.ChEMBL_699224 (CHEMBL1646946)
Ki 6725±n/a nM
Citation Simard, DLeblanc, YBerthelette, CZaghdane, MHMolinaro, CWang, ZGallant, MLau, SThao, THamel, MStocco, RSawyer, NSillaots, SGervais, FHoule, RLévesque, JF Azaindoles as potent CRTH2 receptor antagonists. Bioorg Med Chem Lett21:841-5 (2011) 
 
Prostaglandin D2 receptor 2
Name:Prostaglandin D2 receptor 2
Type:Enzyme
Mol. Mass.:43295.45
Organism:Homo sapiens (Human)
Description:Q9Y5Y4
Residue:395
BDBM50333492
NameBDBM50333492
Synonyms:(R)-2-(7-(4-fluoro-N-methylphenylsulfonamido)-6,7,8,9-tetrahydropyrido[3,4-b]indolizin-10-yl)acetic acid | CHEMBL1641806
TypeSmall organic molecule
Emp. Form.C20H20FN3O4S
Mol. Mass.417.454
SMILESCN([C@@H]1CCc2c(CC(O)=O)c3cnccc3n2C1)S(=O)(=O)c1ccc(F)cc1