Reaction Details
TargetProstaglandin D2 receptor 2
LigandBDBM50333499
Substrate/Competitorn/a
Meas. Tech.ChEMBL_699224 (CHEMBL1646946)
Ki 4.7±n/a nM
Citation Simard, DLeblanc, YBerthelette, CZaghdane, MHMolinaro, CWang, ZGallant, MLau, SThao, THamel, MStocco, RSawyer, NSillaots, SGervais, FHoule, RLévesque, JF Azaindoles as potent CRTH2 receptor antagonists. Bioorg Med Chem Lett21:841-5 (2011) 
 
Prostaglandin D2 receptor 2
Name:Prostaglandin D2 receptor 2
Type:Enzyme
Mol. Mass.:43295.45
Organism:Homo sapiens (Human)
Description:Q9Y5Y4
Residue:395
BDBM50333499
NameBDBM50333499
Synonyms:(R)-2-(8-(2-(4-fluorophenyl)-N,2-dimethylpropanamido)-6,7,8,9-tetrahydropyrido[3,2-b]indolizin-5-yl)acetic acid | CHEMBL1641813
TypeSmall organic molecule
Emp. Form.C24H26FN3O3
Mol. Mass.423.4799
SMILESCN([C@@H]1CCc2c(CC(O)=O)c3cccnc3n2C1)C(=O)C(C)(C)c1ccc(F)cc1