Reaction Details
TargetProstaglandin D2 receptor
LigandBDBM50333491
Substrate/Competitorn/a
Meas. Tech.ChEMBL_699227 (CHEMBL1646949)
Ki>4000±n/a nM
Citation Simard, DLeblanc, YBerthelette, CZaghdane, MHMolinaro, CWang, ZGallant, MLau, SThao, THamel, MStocco, RSawyer, NSillaots, SGervais, FHoule, RLévesque, JF Azaindoles as potent CRTH2 receptor antagonists. Bioorg Med Chem Lett21:841-5 (2011) 
 
Prostaglandin D2 receptor
Name:Prostaglandin D2 receptor
Type:Enzyme
Mol. Mass.:40288.87
Organism:Homo sapiens (Human)
Description:Q13258
Residue:359
BDBM50333491
NameBDBM50333491
Synonyms:(R)-2-(8-(1-(4-fluorophenyl)-N-methylcyclopentanecarboxamido)-6,7,8,9-tetrahydropyrido[3,2-b]indolizin-5-yl)acetic acid | CHEMBL1641817
TypeSmall organic molecule
Emp. Form.C26H28FN3O3
Mol. Mass.449.5172
SMILESCN([C@@H]1CCc2c(CC(O)=O)c3cccnc3n2C1)C(=O)C1(CCCC1)c1ccc(F)cc1