Reaction Details
TargetThromboxane A2 receptor
LigandBDBM50333501
Substrate/Competitorn/a
Meas. Tech.ChEMBL_699228 (CHEMBL1646950)
Ki>7200±n/a nM
Citation Simard, DLeblanc, YBerthelette, CZaghdane, MHMolinaro, CWang, ZGallant, MLau, SThao, THamel, MStocco, RSawyer, NSillaots, SGervais, FHoule, RLévesque, JF Azaindoles as potent CRTH2 receptor antagonists. Bioorg Med Chem Lett21:841-5 (2011) 
 
Thromboxane A2 receptor
Name:Thromboxane A2 receptor
Type:Enyzme
Mol. Mass.:37445.28
Organism:Homo sapiens (Human)
Description:P21731
Residue:343
BDBM50333501
NameBDBM50333501
Synonyms:2-((8R)-8-(1-(4-fluorophenyl)-N,2,2-trimethylcyclopropanecarboxamido)-6,7,8,9-tetrahydropyrido[3,2-b]indolizin-5-yl)acetic acid | CHEMBL1641815
TypeSmall organic molecule
Emp. Form.C26H28FN3O3
Mol. Mass.449.5172
SMILESCN([C@@H]1CCc2c(CC(O)=O)c3cccnc3n2C1)C(=O)C1(CC1(C)C)c1ccc(F)cc1