Reaction Details
TargetHistamine H3 receptor
LigandBDBM50333511
Substrate/Competitorn/a
Meas. Tech.ChEMBL_699500 (CHEMBL1647755)
Ki 4±n/a nM
Citation Xiao, DPalani, ASofolarides, MHuang, YAslanian, RVaccaro, HHong, LMcKittrick, BWest, REWilliams, SMWu, RLHwa, JSondey, CLachowicz, J Discovery of a series of potent arylthiadiazole H(3) antagonists. Bioorg Med Chem Lett21:861-4 (2011) 
 
Histamine H3 receptor
Name:Histamine H3 receptor
Type:G Protein-Coupled Receptor (GPCR)
Mol. Mass.:48691.47
Organism:Homo sapiens (Human)
Description:Binding assays were using CHO cells stably expressing hH3R receptors.
Residue:445
BDBM50333511
NameBDBM50333511
Synonyms:1-(3-(5-(1,4'-bipiperidin-1'-yl)-1,3,4-thiadiazol-2-yl)phenyl)ethanone | CHEMBL1641828
TypeSmall organic molecule
Emp. Form.C20H26N4OS
Mol. Mass.370.512
SMILESCC(=O)c1cccc(c1)-c1nnc(s1)N1CCC(CC1)N1CCCCC1