Reaction Details
TargetHistamine H3 receptor
LigandBDBM50333520
Substrate/Competitorn/a
Meas. Tech.ChEMBL_699500 (CHEMBL1647755)
Ki 3.5±n/a nM
Citation Xiao, DPalani, ASofolarides, MHuang, YAslanian, RVaccaro, HHong, LMcKittrick, BWest, REWilliams, SMWu, RLHwa, JSondey, CLachowicz, J Discovery of a series of potent arylthiadiazole H(3) antagonists. Bioorg Med Chem Lett21:861-4 (2011) 
 
Histamine H3 receptor
Name:Histamine H3 receptor
Type:G Protein-Coupled Receptor (GPCR)
Mol. Mass.:48691.47
Organism:Homo sapiens (Human)
Description:Binding assays were using CHO cells stably expressing hH3R receptors.
Residue:445
BDBM50333520
NameBDBM50333520
Synonyms:2-(1,4'-bipiperidin-1'-yl)-5-(6-methoxypyridin-2-yl)-1,3,4-thiadiazole | CHEMBL1641837
TypeSmall organic molecule
Emp. Form.C18H25N5OS
Mol. Mass.359.489
SMILESCOc1cccc(n1)-c1nnc(s1)N1CCC(CC1)N1CCCCC1