Reaction Details
TargetPotassium voltage-gated channel subfamily H member 2
LigandBDBM50333615
Substrate/Competitorn/a
Meas. Tech.ChEMBL_699750 (CHEMBL1648563)
IC50 1.7±n/a nM
Citation Haga, YMizutani, SNaya, AKishino, HIwaasa, HIto, MIto, JMoriya, MSato, NTakenaga, NIshihara, ATokita, SKanatani, AOhtake, N Discovery of novel phenylpyridone derivatives as potent and selective MCH1R antagonists. Bioorg Med Chem19:883-93 (2011) 
 
Potassium voltage-gated channel subfamily H member 2
Name:Potassium voltage-gated channel subfamily H member 2
Type:Multi-pass membrane protein
Mol. Mass.:126672.65
Organism:Homo sapiens (Human)
Description:Q12809
Residue:1159
BDBM50333615
NameBDBM50333615
Synonyms:4-[(4-Chlorobenzyl)oxy]-1-{4-[2-(pyrrolidin-1-yl)ethoxy]-phenyl}pyridin-2(1H)-one | CHEMBL1642475
TypeSmall organic molecule
Emp. Form.C24H25ClN2O3
Mol. Mass.424.92
SMILESClc1ccc(COc2ccn(-c3ccc(OCCN4CCCC4)cc3)c(=O)c2)cc1