Reaction Details
TargetAurora kinase A
LigandBDBM50333656
Substrate/Competitorn/a
Meas. Tech.ChEMBL_700207 (CHEMBL1647308)
IC50 0.5±n/a nM
Citation Morshed, MNCho, YSSeo, SHHan, KCYang, EGPae, AN Computational approach to the identification of novel Aurora-A inhibitors. Bioorg Med Chem19:907-16 (2011) 
 
Aurora kinase A
Name:Aurora kinase A
Type:Serine/threonine-protein kinase
Mol. Mass.:45830.98
Organism:Homo sapiens (Human)
Description:O14965
Residue:403
BDBM50333656
NameBDBM50333656
Synonyms:(2,3-dichlorophenyl)(4-(3-(thiazol-2-ylamino)benzyl)piperazin-1-yl)methanone | CHEMBL1643135
TypeSmall organic molecule
Emp. Form.C21H20Cl2N4OS
Mol. Mass.447.381
SMILESClc1cccc(C(=O)N2CCN(Cc3cccc(Nc4nccs4)c3)CC2)c1Cl