Reaction Details
TargetAurora kinase A
LigandBDBM12103
Substrate/Competitorn/a
Meas. Tech.ChEMBL_700207 (CHEMBL1647308)
IC50 5±n/a nM
Citation Morshed, MNCho, YSSeo, SHHan, KCYang, EGPae, AN Computational approach to the identification of novel Aurora-A inhibitors. Bioorg Med Chem19:907-16 (2011) 
 
Aurora kinase A
Name:Aurora kinase A
Type:Serine/threonine-protein kinase
Mol. Mass.:45830.98
Organism:Homo sapiens (Human)
Description:O14965
Residue:403
BDBM12103
NameBDBM12103
Synonyms:1,4,5,6-Tetrahydropyrrolo[3,4-c]pyrazole 11 4-tert-butyl-N-{5-[2-(thiophen-2-yl)acetyl]-1H,4H,5H,6H-pyrrolo[3,4-c]pyrazol-3-yl}benzamide | CHEMBL484007
TypeSmall organic molecule
Emp. Form.C22H24N4O2S
Mol. Mass.408.517
SMILESCC(C)(C)c1ccc(cc1)C(=O)Nc1[nH]nc2CN(Cc12)C(=O)Cc1cccs1