Reaction Details
TargetAurora kinase A
LigandBDBM50333666
Substrate/Competitorn/a
Meas. Tech.ChEMBL_700207 (CHEMBL1647308)
IC50 5090±n/a nM
Citation Morshed, MNCho, YSSeo, SHHan, KCYang, EGPae, AN Computational approach to the identification of novel Aurora-A inhibitors. Bioorg Med Chem19:907-16 (2011) 
 
Aurora kinase A
Name:Aurora kinase A
Type:Serine/threonine-protein kinase
Mol. Mass.:45830.98
Organism:Homo sapiens (Human)
Description:O14965
Residue:403
BDBM50333666
NameBDBM50333666
Synonyms:CHEMBL1643147 | N-(1-(2,4-dimethylphenylamino)-3-(4-hydroxyphenyl)-1-oxopropan-2-yl)-2-(4-methoxybenzamido)benzamide
TypeSmall organic molecule
Emp. Form.C32H31N3O5
Mol. Mass.537.6056
SMILESCOc1ccc(cc1)C(=O)Nc1ccccc1C(=O)NC(Cc1ccc(O)cc1)C(=O)Nc1ccc(C)cc1C