Reaction Details
TargetProstaglandin E2 receptor EP4 subtype
LigandBDBM50333727
Substrate/Competitorn/a
Meas. Tech.ChEMBL_700671 (CHEMBL1645710)
Ki 0.330000±n/a nM
Citation Li, LMathieu, MCDenis, DTherien, AGWang, Z The identification of substituted benzothiophene derivatives as PGE(2) subtype 4 receptor antagonists: From acid to non-acid. Bioorg Med Chem Lett21:734-7 (2011) 
 
Prostaglandin E2 receptor EP4 subtype
Name:Prostaglandin E2 receptor EP4 subtype
Type:Enzyme
Mol. Mass.:53134.53
Organism:Homo sapiens (Human)
Description:P35408
Residue:488
BDBM50333727
NameBDBM50333727
Synonyms:3-(4-((N-(1-(2-methoxyphenyl)cyclopropanecarbonyl)sulfamoyl)methyl)phenyl)-N,N,5,7-tetramethylbenzo[b]thiophene-2-carboxamide | CHEMBL1644006
TypeSmall organic molecule
Emp. Form.C31H32N2O5S2
Mol. Mass.576.726
SMILESCOc1ccccc1C1(CC1)C(=O)NS(=O)(=O)Cc1ccc(cc1)-c1c(sc2c(C)cc(C)cc12)C(=O)N(C)C