Reaction Details
TargetProstaglandin E2 receptor EP4 subtype
LigandBDBM50333731
Substrate/Competitorn/a
Meas. Tech.ChEMBL_700671 (CHEMBL1645710)
Ki 0.410000±n/a nM
Citation Li, LMathieu, MCDenis, DTherien, AGWang, Z The identification of substituted benzothiophene derivatives as PGE(2) subtype 4 receptor antagonists: From acid to non-acid. Bioorg Med Chem Lett21:734-7 (2011) 
 
Prostaglandin E2 receptor EP4 subtype
Name:Prostaglandin E2 receptor EP4 subtype
Type:Enzyme
Mol. Mass.:53134.53
Organism:Homo sapiens (Human)
Description:P35408
Residue:488
BDBM50333731
NameBDBM50333731
Synonyms:CHEMBL1644010 | N-(4-(5,7-dimethyl-2-(pyrrolidine-1-carbonyl)benzo[b]thiophen-3-yl)phenethylcarbamoyl)-4-methylbenzenesulfonamide
TypeSmall organic molecule
Emp. Form.C31H33N3O4S2
Mol. Mass.575.741
SMILESCc1ccc(cc1)S(=O)(=O)NC(=O)NCCc1ccc(cc1)-c1c(sc2c(C)cc(C)cc12)C(=O)N1CCCC1