Reaction Details
TargetProstaglandin E2 receptor EP4 subtype
LigandBDBM50333733
Substrate/Competitorn/a
Meas. Tech.ChEMBL_700672 (CHEMBL1645711)
Ki 40±n/a nM
Citation Li, LMathieu, MCDenis, DTherien, AGWang, Z The identification of substituted benzothiophene derivatives as PGE(2) subtype 4 receptor antagonists: From acid to non-acid. Bioorg Med Chem Lett21:734-7 (2011) 
 
Prostaglandin E2 receptor EP4 subtype
Name:Prostaglandin E2 receptor EP4 subtype
Type:Enzyme
Mol. Mass.:53134.53
Organism:Homo sapiens (Human)
Description:P35408
Residue:488
BDBM50333733
NameBDBM50333733
Synonyms:5,7-difluoro-N,N-dimethyl-3-(4-(2-(3-tosylureido)ethyl)phenyl)benzo[b]thiophene-2-carboxamide | CHEMBL1644012
TypeSmall organic molecule
Emp. Form.C27H25F2N3O4S2
Mol. Mass.557.632
SMILESCN(C)C(=O)c1sc2c(F)cc(F)cc2c1-c1ccc(CCNC(=O)NS(=O)(=O)c2ccc(C)cc2)cc1