Reaction Details
TargetProstaglandin D2 receptor 2
LigandBDBM50333850
Substrate/Competitorn/a
Meas. Tech.ChEMBL_699801 (CHEMBL1645647)
Ki 1.4±n/a nM
Citation Gallant, MBeaulieu, CBerthelette, CColucci, JCrackower, MADalton, CDenis, DDucharme, YFriesen, RWGuay, DGervais, FGHamel, MHoule, RKrawczyk, CMKosjek, BLau, SLeblanc, YLee, EELevesque, JFMellon, CMolinaro, CMullet, WO'Neill, GPO'Shea, PSawyer, NSillaots, SSimard, DSlipetz, DStocco, RSørensen, DTruong, VLWong, EWu, JZaghdane, HWang, Z Discovery of MK-7246, a selective CRTH2 antagonist for the treatment of respiratory diseases. Bioorg Med Chem Lett21:288-93 (2010) 
 
Prostaglandin D2 receptor 2
Name:Prostaglandin D2 receptor 2
Type:Enzyme
Mol. Mass.:43295.45
Organism:Homo sapiens (Human)
Description:Q9Y5Y4
Residue:395
BDBM50333850
NameBDBM50333850
Synonyms:(R)-2-(7-(4-fluoro-N-(4-fluorobenzyl)phenylsulfonamido)-6,7,8,9-tetrahydropyrido[1,2-a]indol-10-yl)acetic acid | CHEMBL1643789
TypeSmall organic molecule
Emp. Form.C27H24F2N2O4S
Mol. Mass.510.552
SMILESOC(=O)Cc1c2CC[C@H](Cn2c2ccccc12)N(Cc1ccc(F)cc1)S(=O)(=O)c1ccc(F)cc1